{"text_format":"1","workbook":"xlsx","n_sheets":6,"sheets":["Main","Procedure","Competencies Table","Lists","Competency Working","Workbook Parameters"],"not_rendered":{"charts":0,"images":2,"macros":1,"external_links":0,"defined_names":42,"comments":0,"pivot_tables":0},"unopened":[],"bounds":{"document_bytes":16777216,"sheet_cells":100000,"rows_first":2000,"rows_last":500,"rows_between":2000,"halvings":0,"cell_chars":16384,"cell_head_chars":4096},"cells_cut":0,"cells_raw":0,"read":"whole","date_system":"1900"}

{"sheet":"Main","index":0,"n_rows":111,"n_cols":14,"rows_kept":111,"cut":false,"hidden":false,"merged":[[14,10,14,12],[16,12,16,13],[90,10,90,13],[92,10,92,13],[94,10,94,13],[49,10,49,13],[20,12,20,13],[50,10,50,13],[85,10,85,13],[74,10,74,13],[51,10,51,13],[52,10,52,11],[71,10,71,13],[61,10,61,11],[66,10,66,11],[65,10,65,13],[104,10,104,13],[97,10,97,13],[98,10,98,13],[99,10,99,13],[100,10,100,13],[101,10,101,13],[102,10,102,13],[103,10,103,13],[76,10,76,13],[77,10,77,13],[95,10,95,13],[96,10,96,13],[87,10,87,13],[21,12,21,13],[21,10,21,11],[67,11,67,13],[68,11,68,13],[69,11,69,13],[53,10,53,11],[54,10,54,11],[55,10,55,11],[56,10,56,11],[57,10,57,11],[58,10,58,11],[59,10,59,11],[58,12,58,13],[59,12,59,13],[57,12,57,13],[56,12,56,13],[63,12,63,13],[63,10,63,11],[55,12,55,13],[54,12,54,13],[53,12,53,13],[62,10,62,11],[62,12,62,13]]}
[null,{"$f":"INDEX(C1:I1,$B$2)","v":0},0,{"$f":"IFERROR(INDEX(DisciplineTable[Discipline Max 6 Permitted],Main!D2),\"\")","v":"Mechanical"},{"$f":"IFERROR(INDEX(DisciplineTable[Discipline Max 6 Permitted],Main!E2),\"\")","v":"Electrical"},{"$f":"IFERROR(INDEX(DisciplineTable[Discipline Max 6 Permitted],Main!F2),\"\")","v":0},{"$f":"IFERROR(INDEX(DisciplineTable[Discipline Max 6 Permitted],Main!G2),\"\")","v":""},{"$f":"IFERROR(INDEX(DisciplineTable[Discipline Max 6 Permitted],Main!H2),\"\")","v":""},{"$f":"IFERROR(INDEX(DisciplineTable[Discipline Max 6 Permitted],Main!I2),\"\")","v":""},null,null,null,{"$f":"IF(AdminAccess=TRUE,\"WARNING: Admin Mode On\",\"\")","v":""},"Contractor Form Version 2.3"]
["Indexes:",{"$f":"MATCH(L17,C1:I1,0)","v":1},0,1,2,3,4,5,6]
[null,{"$f":"INDEX(C3:I3,$B$2)","v":"Yes"},"Yes","Yes","Yes","Yes",null,null,null,null,{"$f":"\"Statutory Appointment Letter - \"&L17","v":"Statutory Appointment Letter - "},null,null,"CF Version 2.3"]
[null,"Yes","Yes","Yes","Yes","Yes"]
[null,"Yes","Yes","Yes","Yes","Yes",null,null,null,null,"* Surname:",null,"* Given Names:"]
[null,"Yes","Yes","Yes","Yes","Yes"]
[null,"Yes","Yes","Yes","Yes","Yes",null,null,null,null,"* Date of Birth (DD/MM/YYYY):",null,"* Occupation:"]
[null,"Yes","Yes","Yes","Yes","Yes"]
[null,"Yes","Yes","Yes","Yes","Yes",null,null,null,null,"* Certifcate of Proficiency or Equiv:",null,"Qualifications - Other:"]
[null,"Yes","Yes","Yes","Yes","Yes"]
[null,"Yes","Yes","Yes","Yes","Yes",null,null,null,null,"* Company:",null,"* Pegasus Number:"]
[null,"Yes","Yes","Yes","Yes","Yes"]
[null,"Yes","Yes","Yes","Yes","Yes",null,null,null,null,"* Date (DD/MM/YYYY):"]
[null,"Yes","Yes","Yes","Yes","Yes"]
[null,"Yes","Yes","Yes","Yes","Yes",null,null,null,null,"* I confirm I have read and prepared this document and the supporting attachments for review as per the requirements of Mt Arthur Coal. Failure to do this may result in rejection of appointment. (Click \"Show Requirements & Quick Reference Guide\" for detailed information)"]
{"$rows_left_out":97}
{"sheet":"Procedure","index":1,"n_rows":0,"n_cols":0,"rows_kept":0,"cut":false,"hidden":false,"merged":[]}

{"sheet":"Competencies Table","index":2,"n_rows":39,"n_cols":44,"rows_kept":39,"cut":false,"hidden":true,"merged":[]}
[null,null,null,null,null,null,null,null,null,null,null,null,null,null,null,null,"k"]
[]
[]
[]
["Competency Name:",null,"Fitter - Type 1","Fitter - Type 1B","Fitter - Type 2","Fitter - Type 2B","Fitter - Type 3","Fitter - Type 3B","Fitter - Type 4","Fitter - Type 4b","Plant Mechanic - Type 1","Plant Mechanic - Type 1B","Boilermaker","Fabricator - Type 1","Fabricator - Type 2","High Pressure Hosing","Automotive Mechanic","Motor Mechanic","Supervisor - Type 1","Supervisor - Type 2","Supervisor - Type 3","Apprentice","Fire Systems","Tyre Technician","OEM Technician","Category 3 Lift Supervisor","Specialist / Other","Statutory Electrical Engineer","Electrical Engineer","Specialist Engineer","Electrical Supervisor","High Voltage","Electrical HV Permit Holder/Verifi","Low Voltage   ","Extra Low Voltage ","Electrical Technician","Fibre Optics/Data","Auto Electrical","Refrigeration/Air Conditioning","Specialist /Other","Overhead Line Worker","Cable Repairers","Electrical Control Systems - Software and Coding","Apprentice/Trades Assistant"]
["Discipline:",null,"Mechanical","Mechanical","Mechanical","Mechanical","Mechanical","Mechanical","Mechanical","Mechanical","Mechanical","Mechanical","Mechanical","Mechanical","Mechanical","Mechanical","Mechanical","Mechanical","Mechanical","Mechanical","Mechanical","Mechanical","Mechanical","Mechanical","Mechanical","Mechanical","Mechanical","Electrical","Electrical","Electrical","Electrical","Electrical","Electrical","Electrical","Electrical","Electrical","Electrical","Electrical","Electrical","Electrical","Electrical","Electrical","Electrical","Electrical"]
["Level of Supervision Required:",null,"General","General","General","General","General","General","General","General","General","General","General","General","General","General","General","General","General","General","General","General","General","General","General","General","General","General","General","General","General","General","General","General","General","General","General","General","General","General","General","General","General","Direct"]
["Competencies:",null,"* Statement of Competency","* Statement of Competency","* Statement of Competency","* Statement of Competency","* Statement of Competency with min. 2 years experience in earthmoving equipment","* Statement of Competency with min. 2 years experience in earthmoving equipment","* Statement of Competency with min. 2 years experience in earthmoving equipment","* Statement of Competency with min. 2 years experience in earthmoving equipment","* Statement of Competency","* Statement of Competency","* Statement of Competency","* Statement of Competency","* Statement of Competency","* Statement of Competency","* Statement of Competency","* Statement of Competency","* Statement of Competency","* Statement of Competency","* Work cover license for intermediate rigging","* Statement of Competency","* Statement of Competency","* Statement of Competency","* Statement of Competency","* Statement of Competency","* Statement of Competency","* Statement of Competency","* Statement of Competency","* Statement of Competency","* Statement of Competency","* Statement of Competency","* Statement of Competency","* Statement of Competency","* Statement of Competency","* Statement of Competency","* Statement of Competency","* Statement of Competency","* Statement of Competency","* Statement of Competency","* Statement of Competency","* Statement of Competency","* Statement of Competency","* Statement of Competency"]
[null,null,"T Basic Structural","T Basic Structural","T Basic Structural","T Basic Structural","T Ancillary Plant. Pumps, Lighting towers etc.","T Ancillary Plant. Pumps, Lighting towers etc.","T OEM Technician","T OEM Technician","T Ancillary Plant. Pumps, Lighting towers etc.","T Ancillary Plant. Pumps, Lighting towers etc.","T Advanced welding","T Fabrication","T Advanced welding","T Assembly of Hydraulic & Pneumatic hoses","T Automotive Mechanic (Light Vehicle)","T Ancillary Plant. Pumps, Lighting towers etc.","T Provide Personnel Supervision","T Provide Personnel Supervision","T Supervise Category 3 Lifting Operations","T 1st Year - NOT ALLOWED ONSITE","T Service & install portable fire extinguishers and fire blankets","T Remove, inspect and fit heavy vehicle wheel assemblies","T OEM works as Approved by Mechanical Statutory Engineer","T Supervise category 3 lifts","T Specialist / Other works as Approved by Mechanical Statutory Engineer","Relevant Trade/Engineering Certificate","Relevant Trade/Engineering Certificate","Relevant Trade/Engineering Certificate","* Relevant Trade/Engineering Certificate","* Relevant Trade/Engineering Certificate","Relevant Trade/Engineering Certificate","* Relevant Trade/Engineering Certificate","* Relevant Trade/Engineering Certificate","* Relevant Trade/Engineering Certificate","Relevant Trade/Engineering Certificate","* Relevant Trade/Engineering Certificate","* Relevant Trade/Engineering Certificate","* Qualifications \\ Internal Training","* Relevant Trade/Engineering Certificate","Relevant Trade/Engineering Certificate","Relevant Trade/Engineering Certificate","Relevant Trade/Engineering Certificate"]
[null,null,"* Certificate of Proficiency or Equivalent (Provide Transcript)","* Certificate of Proficiency or Equivalent (Provide Transcript)","* Certificate of Proficiency or Equivalent (Provide Transcript)","* Certificate of Proficiency or Equivalent (Provide Transcript)","* Certificate of Proficiency or Equivalent (Provide Transcript)","* Certificate of Proficiency or Equivalent (Provide Transcript)","* Certificate of Proficiency or Equivalent (Provide Transcript)","* Certificate of Proficiency or Equivalent (Provide Transcript)","* Certificate of Proficiency or Equivalent (Provide Transcript)","* Certificate of Proficiency or Equivalent (Provide Transcript)","* Certificate of Proficiency or Equivalent (Provide Transcript)","* Certificate of Proficiency or Equivalent (Provide Transcript)","* Certificate of Proficiency or Equivalent (Provide Transcript)","* Qualifications \\ Internal Training","* Certificate of Proficiency or Equivalent (Provide Transcript)","* Certificate of Proficiency or Equivalent (Provide Transcript)","* Apply risk management or equivalent (S1)","* Apply risk management or equivalent (S1)","* Experience in crane operations being supervised","* Indenture Papers","* Qualifications \\ Internal Training","* Qualifications \\ Internal Training","* Qualifications \\ Internal Training","* Work cover license for intermediate rigging","* Qualifications \\ Internal Training","* Engineering Qualifications Recognised by Engineers Australia","* Engineering Qualifications Recognised by Engineers Australia","* Engineering Qualifications Recognised by Engineers Australia","Engineering Qualifications Recognised by Engineers Australia","Engineering Qualifications Recognised by Engineers Australia","Engineering Qualifications Recognised by Engineers Australia","Engineering Qualifications Recognised by Engineers Australia","Engineering Qualifications Recognised by Engineers Australia","Engineering Qualifications Recognised by Engineers Australia","Engineering Qualifications Recognised by Engineers Australia","Engineering Qualifications Recognised by Engineers Australia","Engineering Qualifications Recognised by Engineers Australia",null,"Engineering Qualifications Recognised by Engineers Australia","Engineering Qualifications Recognised by Engineers Australia","* Engineering Qualifications Recognised by Engineers Australia","Engineering Qualifications Recognised by Engineers Australia"]
[null,null,"T Fixed Plant","T Fixed Plant","T Fixed Plant","T Fixed Plant","T Automotive Electrical - Up to 24Volts","T Automotive Electrical - Up to 24Volts","T Mobile Plant Restricted","T Mobile Plant Restricted","T Automotive Electrical - Up to 24Volts","T Automotive Electrical - Up to 24Volts","T Intermediate welding","T Basic Structural","T Intermediate welding","T Automotive Electrical - Up to 24Volts","T Ancillary Plant","T Automotive Electrical - Up to 24Volts","T  ","T Provide Technical Supervision","T ","T 2nd Year - NOT ALLOWED ONSITE","T Service & Inspect and service delivery lay flat fire hoses and nozzles","T Remove, inspect, repair and fit tyres and tubes (heavy)",null,"T ","T ","* DII Certificate of Competence or Chartered Status","DII Certificate of Competence or Chartered Status","DII Certificate of Competence or Chartered Status","DII Certificate of Competence or Chartered Status","DII Certificate of Competence or Chartered Status","DII Certificate of Competence or Chartered Status","DII Certificate of Competence or Chartered Status","DII Certificate of Competence or Chartered Status","DII Certificate of Competence or Chartered Status","DII Certificate of Competence or Chartered Status","DII Certificate of Competence or Chartered Status","DII Certificate of Competence or Chartered Status",null,"DII Certificate of Competence or Chartered Status","DII Certificate of Competence or Chartered Status","DII Certificate of Competence or Chartered Status","DII Certificate of Competence or Chartered Status"]
[null,null,"* Perform engineering measurements","* Perform engineering measurements","* Perform engineering measurements","* Perform engineering measurements","* Test, repair and overhaul diesel fuel injection systems and compression ignition .","* Test, repair and overhaul diesel fuel injection systems and compression ignition .","* Repair hydrostatic and manual transmissions.","* Repair hydrostatic and manual transmissions.","* Test, repair and overhaul diesel fuel injection systems and compression ignition .","* Test, repair and overhaul diesel fuel injection systems and compression ignition .","* MDG25 Safe Cutting and Welding (Valid within 5 years)","* Perform engineering measurements","*MDG25 (Valid within 5 years)","T ","* Mechanical Vehicle Repair Industry Certificate (MVRIC)","T  ","* Conduct safety & health investigations or equivalent (S2)","* Conduct safety & health investigations or equivalent (S2)","* Been assessed through ‘due process’ in relation to preparation of lift\ndocumentation and supervision","T ","T ","T ",null,"* Experience in crane operations being supervised","T ","Recognised Training","Recognised Training","Recognised Training","* Recognised Training","* Recognised Training","* Recognised Training","Recognised Training","Recognised Training","* Recognised Training","* Recognised Training","* Recognised Training","* Recognised Training",null,"* Recognised Training","* Recognised Training","* Recognised Training","* Recognised Training"]
[null,null,"T Maintain & Overhaul Mechanical Equipment (Non Mobile Plant)","T Maintain & Overhaul Mechanical Equipment (Non Mobile Plant)","T Hydraulic Work","T Hydraulic Work","T Automotive Light Vehicle","T Automotive Light Vehicle","T ","T ","T Automotive Light Vehicle","T Automotive Light Vehicle","T General welding","T Fixed Plant","T General welding","T Manufacture Fluid Conveying System Conductors","T Maintain and overhaul mechanical equipment (Non Mobile plant)","T Automotive Light Vehicle","T   ","T ",null,"T 3rd Year ","T Hydrostatic test portable and wheeled CO2 fire extinguishers","T Select tyres and rims for specific applications (light)",null,"T ","T ","Qualified Supervisors Certificate","Qualified Supervisors Certificate","Qualified Supervisors Certificate","* Qualified Supervisors Certificate","* Qualified Supervisors Certificate","Qualified Supervisors Certificate","* Qualified Supervisors Certificate","Qualified Supervisors Certificate","Qualified Supervisors Certificate","Qualified Supervisors Certificate","Qualified Supervisors Certificate","* Qualified Supervisors Certificate",null,"Qualified Supervisors Certificate","Qualified Supervisors Certificate","Qualified Supervisors Certificate","Qualified Supervisors Certificate"]
[null,null,"* Perform computations","* Perform computations","* Perform computations","* Perform computations","* Diagnose and repair mobile plant final drive assemblies.","* Diagnose and repair mobile plant final drive assemblies.","* Repair hydraulic systems and fluid power controls.","* Repair hydraulic systems and fluid power controls.","* Diagnose and repair mobile plant final drive assemblies.","* Diagnose and repair mobile plant final drive assemblies.","* Perform engineering measurements","* Perform computations","* Perform engineering measurements","T  ","T ","T  ","* Communicate information or equivalent (S3)","* Communicate information or equivalent (S3)",null,"T ","T  ","T ",null,"* Been assessed through 'due process' in relation to preparation of lift documentation ","T ","Australian Communication and Media Authority Open","Australian Communication and Media Authority Open","Australian Communication and Media Authority Open","Australian Communication and Media Authority Open","Australian Communication and Media Authority Open","Australian Communication and Media Authority Open","Australian Communication and Media Authority Open","Australian Communication and Media Authority Open","Australian Communication and Media Authority Open","* Australian Communication and Media Authority Open","Australian Communication and Media Authority Open","Australian Communication and Media Authority Open",null,"Australian Communication and Media Authority Open","Australian Communication and Media Authority Open","Australian Communication and Media Authority Open","Australian Communication and Media Authority Open"]
[null,null,"T Service Fixed Plant","T Service Fixed Plant","T Pneumatic Work","T Pneumatic Work","T Basic Structural","T Basic Structural","T ","T ","T Basic Structural","T Basic Structural","T Basic Structural","T ","T Basic Structural","T Repair Faulty Conductors and Assemblies","T Basic Structural","T Basic Structural","T  ","T ",null,"T 4th Year","T Inspect and test hinged fire and smoke doors","T Select heavy vehicle tyres and rims for specific applications",null,"T ","T ","Refrigerant Handling Licence","Refrigerant Handling Licence","Refrigerant Handling Licence","Refrigerant Handling Licence","Refrigerant Handling Licence","Refrigerant Handling Licence","Refrigerant Handling Licence","Refrigerant Handling Licence","Refrigerant Handling Licence","Refrigerant Handling Licence","Refrigerant Handling Licence","* Refrigerant Handling Licence",null,"Refrigerant Handling Licence","Refrigerant Handling Licence","Refrigerant Handling Licence","Refrigerant Handling Licence"]
{"$rows_left_out":25}
{"sheet":"Lists","index":3,"n_rows":33,"n_cols":4,"rows_kept":33,"cut":false,"hidden":true,"merged":[]}
[]
[null,null,"Discipline Max 6 Permitted"]
[null,null,"Mechanical"]
[null,null,"Electrical"]
[]
[]
[]
[]
[]
[]
[]
[null,null,"Level of Supervision","Supervision Description"]
[null,null,"Direct","Direct supervision is where a person is under the immediate control and direction of the MAC/Contractor supervisor who must be in attendance at all times."]
[null,null,"General","Requires supervision by a MAC supervisor. The nature of the work, the competence of the person, and understanding of the work needs to be considered to ensure safe and satisfactory work practices are   followed when determining the frequency of supervision attendance on the job."]
[]
{"$rows_left_out":19}
{"sheet":"Competency Working","index":4,"n_rows":105,"n_cols":10,"rows_kept":105,"cut":false,"hidden":true,"merged":[]}
[]
[null,null,null,null,"AllAccepted",{"$f":"IF(OR(CompetencyAreaInput=\"\",COUNTIF(MobilePlantTable,FALSE)>0),FALSE,TRUE)","v":false}]
[]
[]
[null,null,"Selected Competency Area","Checkbox Value","Mandatory","Accepted"]
[3,null,{"$f":"T(IFERROR(INDEX(CompetenciesTable[],$A6,'Workbook Parameters'!$B$3),\"\"))","v":""},false,{"$f":"LEFT(C6)=\"*\"","v":false},{"$f":"IF(E6,D6,TRUE)","v":true},null,false,{"$f":"IF(H6=TRUE,#REF!+1,#REF!)","v":{"$error":"#REF!"}},{"$f":"IF(H6=TRUE,#REF!,\"\")","v":""}]
[4,null,{"$f":"T(IFERROR(INDEX(CompetenciesTable[],$A7,'Workbook Parameters'!$B$3),\"\"))","v":""},false,false,true,null,false,{"$f":"IF(H7=TRUE,I6+1,I6)","v":{"$error":"#REF!"}},{"$f":"IF(H7=TRUE,#REF!,\"\")","v":""}]
[5,null,{"$f":"T(IFERROR(INDEX(CompetenciesTable[],$A8,'Workbook Parameters'!$B$3),\"\"))","v":""},false,false,true,null,false,{"$error":"#REF!"},{"$f":"IF(H8=TRUE,#REF!,\"\")","v":""}]
[6,null,{"$f":"T(IFERROR(INDEX(CompetenciesTable[],$A9,'Workbook Parameters'!$B$3),\"\"))","v":""},false,false,true,null,false,{"$error":"#REF!"},{"$f":"IF(H9=TRUE,#REF!,\"\")","v":""}]
[7,null,{"$f":"T(IFERROR(INDEX(CompetenciesTable[],$A10,'Workbook Parameters'!$B$3),\"\"))","v":""},false,false,true,null,false,{"$error":"#REF!"},{"$f":"IF(H10=TRUE,#REF!,\"\")","v":""}]
[8,null,{"$f":"T(IFERROR(INDEX(CompetenciesTable[],$A11,'Workbook Parameters'!$B$3),\"\"))","v":""},false,false,true,null,false,{"$error":"#REF!"},{"$f":"IF(H11=TRUE,#REF!,\"\")","v":""}]
[9,null,{"$f":"T(IFERROR(INDEX(CompetenciesTable[],$A12,'Workbook Parameters'!$B$3),\"\"))","v":""},false,false,true,null,false,{"$error":"#REF!"},{"$f":"IF(H12=TRUE,#REF!,\"\")","v":""}]
[10,null,{"$f":"T(IFERROR(INDEX(CompetenciesTable[],$A13,'Workbook Parameters'!$B$3),\"\"))","v":""},false,false,true,null,false,{"$error":"#REF!"},{"$f":"IF(H13=TRUE,#REF!,\"\")","v":""}]
[11,null,{"$f":"T(IFERROR(INDEX(CompetenciesTable[],$A14,'Workbook Parameters'!$B$3),\"\"))","v":""},false,false,true,null,false,{"$f":"IF(H14=TRUE,I13+1,I13)","v":{"$error":"#REF!"}},{"$f":"IF(H14=TRUE,#REF!,\"\")","v":""}]
[12,null,{"$f":"T(IFERROR(INDEX(CompetenciesTable[],$A15,'Workbook Parameters'!$B$3),\"\"))","v":""},false,false,true,null,false,{"$error":"#REF!"},{"$f":"IF(H15=TRUE,#REF!,\"\")","v":""}]
{"$rows_left_out":91}
{"sheet":"Workbook Parameters","index":5,"n_rows":5,"n_cols":2,"rows_kept":5,"cut":false,"hidden":true,"merged":[]}
[]
[]
["CompetencyColumn",{"$f":"MATCH(CompetencyAreaInput,CompetenciesTable[#Headers],0)","v":{"$error":"#N/A"}}]
["SupervisionRequired",{"$f":"T(IFERROR(INDEX(CompetenciesTable[],2,B3),\"\"))","v":""}]
["AdminAccess",false]